{"text_format":"1","workbook":"xlsx","n_sheets":3,"sheets":["Notes&Reference","Calculator","Dropdown List"],"not_rendered":{"charts":0,"images":4,"macros":1,"external_links":0,"defined_names":7,"comments":0,"pivot_tables":0},"unopened":[],"bounds":{"document_bytes":16777216,"sheet_cells":100000,"rows_first":2000,"rows_last":500,"rows_between":2000,"halvings":0,"cell_chars":16384,"cell_head_chars":4096},"cells_cut":0,"cells_raw":0,"read":"whole","date_system":"1900"}

{"sheet":"Notes&Reference","index":0,"n_rows":46,"n_cols":24,"rows_kept":46,"cut":false,"hidden":false,"merged":[[1,20,1,23],[2,20,4,20],[2,21,4,21],[2,22,4,22],[2,23,4,23],[1,1,1,7],[2,10,4,10],[2,15,4,15],[1,9,1,18],[2,17,4,17],[2,18,4,18],[2,9,4,9],[2,11,4,11],[2,12,4,12],[2,13,4,13],[2,14,4,14],[2,16,4,16]]}
[]
[null,"Notes on Calculator",null,null,null,null,null,null,null,"Salary Scale Used in Calculator",null,null,null,null,null,null,null,null,null,null,"Oncost Breakdown by Employment Type"]
[null,null,null,null,null,null,null,null,null,"Professional Level & Step","Salary Scale from 6/07/2019","Salary Scale from 4/07/2020","Salary Scale from 3/07/2021","Salary Scale from 2/07/2022","Academic Level & Step","Salary Scale from 6/07/2019","Salary Scale from 4/07/2020","Salary Scale from 3/07/2021","Salary Scale from 2/07/2022",null,"Oncost Breakdown","Current Rate","Casual, Continuing, Convertible, Fixed Term, Continuing Contingent\nSGC Superannuation","Continuing, Convertible, Fixed Term, Continuing Contingent\nFull Superannuation"]
[]
[]
[null,null,null,null,null,null,null,null,null,"HEO1 - 01",48774,49603.158000000003,50496,51455,"Level A / RES A - 01",75669,76955.373000000007,78340,79828,null,"Workers Compensation",1.35E-2,"Yes","Yes"]
[null,null,null,null,null,null,null,null,null,"HEO1 - 02",49835,50682.195000000007,51594,52574,"Level A / RES A - 02",79443,80793.531000000017,82248,83811,null,"Payroll Tax",4.9500000000000002E-2,"Yes","Yes"]
[null,null,null,null,null,null,null,null,null,"HEO1 - 03",50895,51760.215000000004,52692,53693,"Level A / RES A - 03",82506,83908.602000000014,85419,87042,null,"Payroll Tax on UniSuper Employer Contribution (Accum1)",4.7000000000000002E-3,"Yes"]
[null,null,null,null,null,null,null,null,null,"HEO2 - 01",52255,53143.335000000006,54100,55128,"Level A / RES A - 04",85571,87025.707000000009,88592,90275,null,"Payroll Tax on Unisuper Employer Contribution (Accum2)",8.3999999999999995E-3,null,"Yes"]
[null,null,null,null,null,null,null,null,null,"HEO2 - 02",53310,54216.270000000004,55192,56241,"Level A / RES A - 05",88637,90143.829000000012,91767,93511,null,"Long Service Leave Levy",0.02,"Yes","Yes"]
[null,null,null,null,null,null,null,null,null,"HEO2 - 03",54890,55823.130000000005,56828,57908,"Level A / RES A - 06",91700,93258.900000000009,94938,96742,null,"Holiday Pay Loading",1.4500000000000001E-2,"Yes","Yes"]
[null,null,null,null,null,null,null,null,null,"HEO2 - 04",55948,56899.116000000009,57923,59024,"Level B / RES B - 01",96423,98062.191000000006,99827,101724,null,"Oncost Total",null,0.1022,0.10589999999999999]
[null,null,null,null,null,null,null,null,null,"HEO3 - 01",57283,58256.811000000009,59306,60433,"Level B / RES B - 02",99960,101659.32,103489,105455,null,"Super Guarantee Levy – UniSuper (Accum1)",0.105,"Yes"]
[null,null,null,null,null,null,null,null,null,"HEO3 - 02",58865,59865.705000000009,60944,62102,"Level B / RES B - 03",103490,105249.33000000002,107143,109179,null,"UniSuper (DBD/Accum2)",0.14000000000000001,null,"Yes"]
[null,null,null,null,null,null,null,null,null,"HEO3 - 03",60442,61469.51400000001,62576,63765,"Level B / RES B - 04",107031,108850.52700000002,110810,112915,null,"UniSuper (Accum1)",0.03,null,"Yes"]
[null,null,null,null,null,null,null,null,null,"HEO3 - 04",62015,63069.255000000005,64204,65424,"Level B / RES B - 05",110565,112444.60500000001,114469,116644,null,"Super Total",null,0.105,0.17]
[null,null,null,null,null,null,null,null,null,"HEO4 - 01",63361,64438.13700000001,65598,66844,"Level B / RES B - 06",114106,116045.80200000001,118135,120380,null,"Oncost Total (NO Severance)",null,0.19719999999999999,0.27589999999999998]
[null,null,null,null,null,null,null,null,null,"HEO4 - 02",64413,65508.021000000008,66687,67954,"Level C / RES C - 01",117641,119640.89700000001,121795,124109,null,"Severance Pay Levy",0.01,"Yes","Yes"]
[null,null,null,null,null,null,null,null,null,"HEO4 - 03",65458,66570.786000000007,67769,69057,"Level C / RES C - 02",121181,123241.07700000002,125459,127843,null,"Oncost Total (INC. Severance)",null,0.2072,0.28589999999999999]
[null,null,null,null,null,null,null,null,null,"HEO4 - 04",66504,67634.568000000014,68852,70160,"Level C / RES C - 03",124718,126838.20600000002,129121,131574]
[null,null,null,null,null,null,null,null,null,"HEO4 - 05",68336,69497.712000000014,70749,72093,"Level C / RES C - 04",128255,130435.33500000002,132783,135306]
[null,null,null,null,null,null,null,null,null,"HEO5 - 01",70399,71595.78300000001,72885,74270,"Level C / RES C - 05",131786,134026.36200000002,136438,139030]
[null,null,null,null,null,null,null,null,null,"HEO5 - 02",72225,73452.825000000012,74775,76196,"Level C / RES C - 06",135324,137624.50800000003,140102,142764]
[null,null,null,null,null,null,null,null,null,"HEO5 - 03",74052,75310.884000000005,76667,78124,"Level D / RES D - 01",141222,143622.774,146208,148986]
[null,null,null,null,null,null,null,null,null,"HEO5 - 04",75875,77164.875000000015,78554,80047,"Level D / RES D - 02",145932,148412.84400000001,151084,153955]
[null,null,null,null,null,null,null,null,null,"HEO5 - 05",77695,79015.815000000017,80438,81966,"Level D / RES D - 03",150652,153213.08400000003,155971,158934]
[null,null,null,null,null,null,null,null,null,"HEO6 - 01",78602,79938.234000000011,81377,82923,"Level D / RES D - 04",155369,158010.27300000002,160854,163910]
[null,null,null,null,null,null,null,null,null,"HEO6 - 02",79903,81261.35100000001,82724,84296,"Level D + - 01",168337,171198.72900000002,174281,177592]
[null,null,null,null,null,null,null,null,null,"HEO6 - 03",81205,82585.485000000015,84072,85669,"Level E - 01",181307,184389.21900000001,187708,191274]
[null,null,null,null,null,null,null,null,null,"HEO6 - 04",82506,83908.602000000014,85419,87042]
[null,null,null,null,null,null,null,null,null,"HEO6 - 05",83806,85230.702000000005,86765,88414]
[null,null,null,null,null,null,null,null,null,"HEO7 - 01",85370,86821.290000000008,88384,90063]
[null,null,null,null,null,null,null,null,null,"HEO7 - 02",87448,88934.616000000009,90536,92256]
[null,null,null,null,null,null,null,null,null,"HEO7 - 03",89530,91052.010000000009,92691,94452]
[null,null,null,null,null,null,null,null,null,"HEO7 - 04",91617,93174.489000000016,94851,96653]
[null,null,null,null,null,null,null,null,null,"HEO7 - 05",94500,96106.500000000015,97837,99696]
[null,null,null,null,null,null,null,null,null,"HEO8 - 01",96820,98465.940000000017,100238,102143]
[null,null,null,null,null,null,null,null,null,"HEO8 - 02",100721,102433.25700000001,104277,106258]
[null,null,null,null,null,null,null,null,null,"HEO8 - 03",104623,106401.59100000001,108317,110375]
[null,null,null,null,null,null,null,null,null,"HEO8 - 04",107187,109009.17900000002,110971,113079]
[null,null,null,null,null,null,null,null,null,"HEO9 - 01",111392,113285.66400000002,115325,117516]
[null,null,null,null,null,null,null,null,null,"HEO9 - 02",115293,117252.98100000001,119364,121632]
[null,null,null,null,null,null,null,null,null,"HEO9 - 03",119197,121223.34900000002,123405,125750]
[null,null,null,null,null,null,null,null,null,"HEO10 - 01",122873,124961.84100000001,127211,129628]
[null,null,null,null,null,null,null,null,null,"HEO10 - 02",126497,128647.44900000002,130963,133451]
[null,null,null,null,null,null,null,null,null,"HEO10 - 03",130229,132442.89300000001,134827,137389]

{"sheet":"Calculator","index":1,"n_rows":21,"n_cols":10,"rows_kept":21,"cut":false,"hidden":false,"merged":[[2,2,2,10],[20,3,21,9]]}
[]
[]
[null,null,"Salary & Oncost Calculator (SA Only)"]
[]
[null,null,null,"Select Position Level & Step*:",null,null,null,"Enter Position Fraction (%)*"]
[]
[null,null,null,null,null,"Start Date*:",null,"End Date (Default 12 Months if not provided):"]
[null,null,null,"Enter Contract Period*:"]
[null,null,null,"(* Mandatory Field)"]
[]
[null,null,null,"    Cost\n                       Staff Position Type",null,"SGC Super (10.5%)",null,"Full Super (17%)",null,"Casuals (10.5%)"]
[]
[null,null,null,"Salary:",null,{"$f":"IF(OR(ISBLANK(F5), ISBLANK(F8), ISBLANK(J5), AND(COUNTBLANK(H8)=0, F8-H8>0)),\"\", (IF(ISBLANK(H8), IF(F8>='Dropdown List'!J1, (NETWORKDAYS(F8, DATE(YEAR(F8)+1, MONTH(F8), (DAY(F8)-1)))*(VLOOKUP(F5, Level_Step, 6, 0)/260.8333)), (NETWORKDAYS(F8, OFFSET('Dropdown List'!F1, 0, (MATCH(F8, 'Dropdown List'!F1:J1, 1))))*(VLOOKUP(F5, Level_Step, (MATCH(F8, 'Dropdown List'!F1:J1, 1)+1), 0)/260.8333) + NETWORKDAYS(OFFSET('Dropdown List'!F1, 0, (MATCH(F8, 'Dropdown List'!F1:J1, 1))), DATE(YEAR(F8)+1, MONTH(F8), (DAY(F8)-1)))*(VLOOKUP(F5, Level_Step, (MATCH(F8, 'Dropdown List'!F1:J1, 1)+2), 0)/260.8333))), IF(MATCH(F8, 'Dropdown List'!F1:J1, 1)=MATCH(H8, 'Dropdown List'!F1:J1, 1), NETWORKDAYS(F8, H8)*(VLOOKUP(F5, Level_Step, (MATCH(H8, 'Dropdown List'!F1:J1, 1)+1), 0)/260.8333), (NETWORKDAYS(F8, OFFSET('Dropdown List'!F1, 0, (MATCH(F8, 'Dropdown List'!F1:J1, 1))))*(VLOOKUP(F5, Level_Step, (MATCH(F8, 'Dropdown List'!F1:J1, 1)+1), 0)/260.8333) + NETWORKDAYS(OFFSET('Dropdown List'!F1, 0, ((MATCH(H8, 'Dropdown List'!F1:J1, 1))-1)), H8)*(VLOOKUP(F5, Level_Step, (MATCH(H8, 'Dropdown List'!F1:J1, 1)+1), 0)/260.8333)+(IF(MATCH(H8, 'Dropdown List'!F1:J1, 1)-MATCH(F8, 'Dropdown List'!F1:J1, 1)<2, 0, IF(MATCH(H8, 'Dropdown List'!F1:J1, 1)-MATCH(F8, 'Dropdown List'!F1:J1, 1)=3, GH_SALARY+HI_SALARY, IF(MATCH(H8, 'Dropdown List'!F1:J1, 1)=4, HI_SALARY, GH_SALARY))))))))*J5/100)","v":""},null,{"$f":"IF(OR(ISBLANK(F5), ISBLANK(F8), ISBLANK(J5), AND(COUNTBLANK(H8)=0, F8-H8>0)),\"\", (IF(ISBLANK(H8), IF(F8>='Dropdown List'!J1, (NETWORKDAYS(F8, DATE(YEAR(F8)+1, MONTH(F8), (DAY(F8)-1)))*(VLOOKUP(F5, Level_Step, 6, 0)/260.8333)), (NETWORKDAYS(F8, OFFSET('Dropdown List'!F1, 0, (MATCH(F8, 'Dropdown List'!F1:J1, 1))))*(VLOOKUP(F5, Level_Step, (MATCH(F8, 'Dropdown List'!F1:J1, 1)+1), 0)/260.8333) + NETWORKDAYS(OFFSET('Dropdown List'!F1, 0, (MATCH(F8, 'Dropdown List'!F1:J1, 1))), DATE(YEAR(F8)+1, MONTH(F8), (DAY(F8)-1)))*(VLOOKUP(F5, Level_Step, (MATCH(F8, 'Dropdown List'!F1:J1, 1)+2), 0)/260.8333))), IF(MATCH(F8, 'Dropdown List'!F1:J1, 1)=MATCH(H8, 'Dropdown List'!F1:J1, 1), NETWORKDAYS(F8, H8)*(VLOOKUP(F5, Level_Step, (MATCH(H8, 'Dropdown List'!F1:J1, 1)+1), 0)/260.8333), (NETWORKDAYS(F8, OFFSET('Dropdown List'!F1, 0, (MATCH(F8, 'Dropdown List'!F1:J1, 1))))*(VLOOKUP(F5, Level_Step, (MATCH(F8, 'Dropdown List'!F1:J1, 1)+1), 0)/260.8333) + NETWORKDAYS(OFFSET('Dropdown List'!F1, 0, ((MATCH(H8, 'Dropdown List'!F1:J1, 1))-1)), H8)*(VLOOKUP(F5, Level_Step, (MATCH(H8, 'Dropdown List'!F1:J1, 1)+1), 0)/260.8333)+(IF(MATCH(H8, 'Dropdown List'!F1:J1, 1)-MATCH(F8, 'Dropdown List'!F1:J1, 1)<2, 0, IF(MATCH(H8, 'Dropdown List'!F1:J1, 1)-MATCH(F8, 'Dropdown List'!F1:J1, 1)=3, GH_SALARY+HI_SALARY, IF(MATCH(H8, 'Dropdown List'!F1:J1, 1)=4, HI_SALARY, GH_SALARY))))))))*J5/100)","v":""},null,{"$f":"IF(OR(ISBLANK(F5), ISBLANK(F8), ISBLANK(J5), AND(COUNTBLANK(H8)=0, F8-H8>0), LEFT(F5,1)=\"L\"),\"\", (IF(ISBLANK(H8), IF(F8>='Dropdown List'!J1, (NETWORKDAYS(F8, DATE(YEAR(F8)+1, MONTH(F8), (DAY(F8)-1)))*(VLOOKUP(REPLACE(F5,IF(MID(F5,5,1)=\" \", 9, 10),1,1), Level_Step, 6, 0)/260.8333*1.25)), (NETWORKDAYS(F8, OFFSET('Dropdown List'!F1, 0, (MATCH(F8, 'Dropdown List'!F1:J1, 1))))*(VLOOKUP(REPLACE(F5,IF(MID(F5,5,1)=\" \", 9, 10),1,1), Level_Step, (MATCH(F8, 'Dropdown List'!F1:J1, 1)+1), 0)/260.8333*1.25) + NETWORKDAYS(OFFSET('Dropdown List'!F1, 0, (MATCH(F8, 'Dropdown List'!F1:J1, 1))), DATE(YEAR(F8)+1, MONTH(F8), (DAY(F8)-1)))*(VLOOKUP(REPLACE(F5,IF(MID(F5,5,1)=\" \", 9, 10),1,1), Level_Step, (MATCH(F8, 'Dropdown List'!F1:J1, 1)+2), 0)/260.8333*1.25))), IF(MATCH(F8, 'Dropdown List'!F1:J1, 1)=MATCH(H8, 'Dropdown List'!F1:J1, 1), NETWORKDAYS(F8, H8)*(VLOOKUP(REPLACE(F5,IF(MID(F5,5,1)=\" \", 9, 10),1,1), Level_Step, (MATCH(H8, 'Dropdown List'!F1:J1, 1)+1), 0)/260.8333*1.25), (NETWORKDAYS(F8, OFFSET('Dropdown List'!F1, 0, (MATCH(F8, 'Dropdown List'!F1:J1, 1))))*(VLOOKUP(REPLACE(F5,IF(MID(F5,5,1)=\" \", 9, 10),1,1), Level_Step, (MATCH(F8, 'Dropdown List'!F1:J1, 1)+1), 0)/260.8333*1.25) + NETWORKDAYS(OFFSET('Dropdown List'!F1, 0, (MATCH(H8, 'Dropdown List'!F1:J1, 1)-1)), H8)*(VLOOKUP(REPLACE(F5,IF(MID(F5,5,1)=\" \", 9, 10),1,1), Level_Step, (MATCH(H8, 'Dropdown List'!F1:J1, 1)+1), 0)/260.8333*1.25)+(IF(MATCH(H8, 'Dropdown List'!F1:J1, 1)-MATCH(F8, 'Dropdown List'!F1:J1, 1)<2, 0, IF(MATCH(H8, 'Dropdown List'!F1:J1, 1)-MATCH(F8, 'Dropdown List'!F1:J1, 1)=3, GH_SALARY_CASUAL+HI_SALARY_CASUAL, IF(MATCH(H8, 'Dropdown List'!F1:J1, 1)=4, HI_SALARY_CASUAL, GH_SALARY_CASUAL))))))))*J5/100)","v":""}]
[]
[null,null,null,"Super:",null,{"$f":"IF(F13=\"\",\"\", F13*'Dropdown List'!B3)","v":""},null,{"$f":"IF(H13=\"\",\"\", H13*'Dropdown List'!B4)","v":""},null,{"$f":"IF(J13=\"\",\"\", J13*'Dropdown List'!B2)","v":""}]
[]
[null,null,null,"Oncost:",null,{"$f":"IF(F13=\"\",\"\", F13*'Dropdown List'!C3)","v":""},null,{"$f":"IF(H13=\"\",\"\", H13*'Dropdown List'!C4)","v":""},null,{"$f":"IF(J13=\"\",\"\", J13*'Dropdown List'!C2)","v":""}]
[]
[null,null,null,"Total Cost",null,{"$f":"IF(F13=\"\",\"\", SUM(F13,F15,F17))","v":""},null,{"$f":"IF(H13=\"\", \"\", SUM(H13,H15,H17))","v":""},null,{"$f":"IF(J13=\"\", \"\", SUM(J13,J15,J17))","v":""}]
[]
[null,null,null,"*Disclaimer: This calculator is to be used as a guide only. Cost is calculated for contract period specified based on the Level & Step selected (i.e. not including future increments if contract > 12 months). See Notes&Reference Worksheet for more information."]

{"sheet":"Dropdown List","index":2,"n_rows":66,"n_cols":10,"rows_kept":66,"cut":false,"hidden":true,"merged":[]}
["Select Staff Position Type","Super%","Oncost%",null,"Level & Step","2018-07-01","2019-07-06","2020-07-04","2021-07-03","2022-07-02"]
["Professional Casual and Academic Casual Teaching",0.105,0.1022,null,"HEO1 - 01",46674,48774,49603.158000000003,50496,51455]
["SGC Super + Severance",0.105,0.11219999999999999,null,"HEO1 - 02",47735,49835,50682.195000000007,51594,52574]
["Full Super + Severance",0.17,0.1159,null,"HEO1 - 03",48795,50895,51760.215000000004,52692,53693]
[null,null,null,null,"HEO2 - 01",50155,52255,53143.335000000006,54100,55128]
[null,null,null,null,"HEO2 - 02",51210,53310,54216.270000000004,55192,56241]
[null,null,null,null,"HEO2 - 03",52790,54890,55823.130000000005,56828,57908]
[null,null,null,null,"HEO2 - 04",53848,55948,56899.116000000009,57923,59024]
[null,null,null,null,"HEO3 - 01",55183,57283,58256.811000000009,59306,60433]
[null,null,null,null,"HEO3 - 02",56765,58865,59865.705000000009,60944,62102]
[null,null,null,null,"HEO3 - 03",58342,60442,61469.51400000001,62576,63765]
[null,null,null,null,"HEO3 - 04",59915,62015,63069.255000000005,64204,65424]
[null,null,null,null,"HEO4 - 01",61261,63361,64438.13700000001,65598,66844]
[null,null,null,null,"HEO4 - 02",62313,64413,65508.021000000008,66687,67954]
[null,null,null,null,"HEO4 - 03",63358,65458,66570.786000000007,67769,69057]
[null,null,null,null,"HEO4 - 04",64404,66504,67634.568000000014,68852,70160]
[null,null,null,null,"HEO4 - 05",66236,68336,69497.712000000014,70749,72093]
[null,null,null,null,"HEO5 - 01",68299,70399,71595.78300000001,72885,74270]
[null,null,null,null,"HEO5 - 02",70125,72225,73452.825000000012,74775,76196]
[null,null,null,null,"HEO5 - 03",71952,74052,75310.884000000005,76667,78124]
[null,null,null,null,"HEO5 - 04",73775,75875,77164.875000000015,78554,80047]
[null,null,null,null,"HEO5 - 05",75595,77695,79015.815000000017,80438,81966]
[null,null,null,null,"HEO6 - 01",76502,78602,79938.234000000011,81377,82923]
[null,null,null,null,"HEO6 - 02",77803,79903,81261.35100000001,82724,84296]
[null,null,null,null,"HEO6 - 03",79105,81205,82585.485000000015,84072,85669]
[null,null,null,null,"HEO6 - 04",80406,82506,83908.602000000014,85419,87042]
[null,null,null,null,"HEO6 - 05",81706,83806,85230.702000000005,86765,88414]
[null,null,null,null,"HEO7 - 01",83270,85370,86821.290000000008,88384,90063]
[null,null,null,null,"HEO7 - 02",85348,87448,88934.616000000009,90536,92256]
[null,null,null,null,"HEO7 - 03",87430,89530,91052.010000000009,92691,94452]
[null,null,null,null,"HEO7 - 04",89517,91617,93174.489000000016,94851,96653]
[null,null,null,null,"HEO7 - 05",92400,94500,96106.500000000015,97837,99696]
[null,null,null,null,"HEO8 - 01",94720,96820,98465.940000000017,100238,102143]
[null,null,null,null,"HEO8 - 02",98621,100721,102433.25700000001,104277,106258]
[null,null,null,null,"HEO8 - 03",102523,104623,106401.59100000001,108317,110375]
[null,null,null,null,"HEO8 - 04",105087,107187,109009.17900000002,110971,113079]
[null,null,null,null,"HEO9 - 01",109292,111392,113285.66400000002,115325,117516]
[null,null,null,null,"HEO9 - 02",113193,115293,117252.98100000001,119364,121632]
[null,null,null,null,"HEO9 - 03",117097,119197,121223.34900000002,123405,125750]
[null,null,null,null,"HEO10 - 01",120773,122873,124961.84100000001,127211,129628]
[null,null,null,null,"HEO10 - 02",124397,126497,128647.44900000002,130963,133451]
[null,null,null,null,"HEO10 - 03",128129,130229,132442.89300000001,134827,137389]
[null,null,null,null,"Level A / RES A - 01",73569,75669,76955.373000000007,78340,79828]
[null,null,null,null,"Level A / RES A - 02",77343,79443,80793.531000000017,82248,83811]
[null,null,null,null,"Level A / RES A - 03",80406,82506,83908.602000000014,85419,87042]
[null,null,null,null,"Level A / RES A - 04",83471,85571,87025.707000000009,88592,90275]
[null,null,null,null,"Level A / RES A - 05",86537,88637,90143.829000000012,91767,93511]
[null,null,null,null,"Level A / RES A - 06",89600,91700,93258.900000000009,94938,96742]
[null,null,null,null,"Level B / RES B - 01",94323,96423,98062.191000000006,99827,101724]
[null,null,null,null,"Level B / RES B - 02",97860,99960,101659.32,103489,105455]
[null,null,null,null,"Level B / RES B - 03",101390,103490,105249.33000000002,107143,109179]
[null,null,null,null,"Level B / RES B - 04",104931,107031,108850.52700000002,110810,112915]
[null,null,null,null,"Level B / RES B - 05",108465,110565,112444.60500000001,114469,116644]
[null,null,null,null,"Level B / RES B - 06",112006,114106,116045.80200000001,118135,120380]
[null,null,null,null,"Level C / RES C - 01",115541,117641,119640.89700000001,121795,124109]
[null,null,null,null,"Level C / RES C - 02",119081,121181,123241.07700000002,125459,127843]
[null,null,null,null,"Level C / RES C - 03",122618,124718,126838.20600000002,129121,131574]
[null,null,null,null,"Level C / RES C - 04",126155,128255,130435.33500000002,132783,135306]
[null,null,null,null,"Level C / RES C - 05",129686,131786,134026.36200000002,136438,139030]
[null,null,null,null,"Level C / RES C - 06",133224,135324,137624.50800000003,140102,142764]
[null,null,null,null,"Level D / RES D - 01",139122,141222,143622.774,146208,148986]
[null,null,null,null,"Level D / RES D - 02",143832,145932,148412.84400000001,151084,153955]
[null,null,null,null,"Level D / RES D - 03",148552,150652,153213.08400000003,155971,158934]
[null,null,null,null,"Level D / RES D - 04",153269,155369,158010.27300000002,160854,163910]
[null,null,null,null,"Level D + - 01",166237,168337,171198.72900000002,174281,177592]
[null,null,null,null,"Level E - 01",179207,181307,184389.21900000001,187708,191274]